Errore compilazione amarok-1.1 CVS
Inviato: dom 15 ago 2004, 15:46
Ciao,
<BR>
<BR>ho un problema nella compilazione di amarok che mi restituisce il seguente errore:
<BR>
<BR>make[3]: Entering directory `/home/hunter/garbage/amarok-1.1-CVS/doc/amarok´
<BR>cd ../.. && /bin/sh ./config.status doc/amarok/Makefile
<BR>fast creating doc/amarok/Makefile
<BR>config.pl: fast created 1 file(s).
<BR>make[3]: Leaving directory `/home/hunter/garbage/amarok-1.1-CVS/doc/amarok´
<BR>make[3]: Entering directory `/home/hunter/garbage/amarok-1.1-CVS/doc/amarok´
<BR>/opt/kde/bin/meinproc --check --cache index.cache.bz2 ./index.docbook
<BR>make[3]: *** [index.cache.bz2] Error 139
<BR>make[3]: Leaving directory `/home/hunter/garbage/amarok-1.1-CVS/doc/amarok´
<BR>make[2]: *** [all-recursive] Error 1
<BR>make[2]: Leaving directory `/home/hunter/garbage/amarok-1.1-CVS/doc´
<BR>make[1]: *** [all-recursive] Error 1
<BR>make[1]: Leaving directory `/home/hunter/garbage/amarok-1.1-CVS´
<BR>make: *** [all] Error 2
<BR>
<BR>Qualcuno ha qualche idea ?
<BR>
<BR>Saluti...<br>
<BR>
<BR>ho un problema nella compilazione di amarok che mi restituisce il seguente errore:
<BR>
<BR>make[3]: Entering directory `/home/hunter/garbage/amarok-1.1-CVS/doc/amarok´
<BR>cd ../.. && /bin/sh ./config.status doc/amarok/Makefile
<BR>fast creating doc/amarok/Makefile
<BR>config.pl: fast created 1 file(s).
<BR>make[3]: Leaving directory `/home/hunter/garbage/amarok-1.1-CVS/doc/amarok´
<BR>make[3]: Entering directory `/home/hunter/garbage/amarok-1.1-CVS/doc/amarok´
<BR>/opt/kde/bin/meinproc --check --cache index.cache.bz2 ./index.docbook
<BR>make[3]: *** [index.cache.bz2] Error 139
<BR>make[3]: Leaving directory `/home/hunter/garbage/amarok-1.1-CVS/doc/amarok´
<BR>make[2]: *** [all-recursive] Error 1
<BR>make[2]: Leaving directory `/home/hunter/garbage/amarok-1.1-CVS/doc´
<BR>make[1]: *** [all-recursive] Error 1
<BR>make[1]: Leaving directory `/home/hunter/garbage/amarok-1.1-CVS´
<BR>make: *** [all] Error 2
<BR>
<BR>Qualcuno ha qualche idea ?
<BR>
<BR>Saluti...<br>