SuprKaramba, se ci riuscissi....help!!!
Inviato: dom 20 mar 2005, 13:51
<b>salve, avrei tanta voglia di installre super karamba, ma proprio nn ne vuole sapere il comando ./configure fa le sue verifiche e finisce corettamente, poi quando lancio il make ecco cosa succede:</b>
<BR><font color="#FF0000">
<BR>root@giovanni:/home/giovanni/Desktop/superkaramba-0.35/superkaramba-0.35# make
<BR>make all-recursive
<BR>make[1]: Entering directory `/home/giovanni/Desktop/superkaramba-0.35/superkaramba-0.35´
<BR>Making all in doc
<BR>make[2]: Entering directory `/home/giovanni/Desktop/superkaramba-0.35/superkaramba-0.35/doc´
<BR>Making all in .
<BR>make[3]: Entering directory `/home/giovanni/Desktop/superkaramba-0.35/superkaramba-0.35/doc´
<BR>make[3]: Nothing to be done for `all-am´.
<BR>make[3]: Leaving directory `/home/giovanni/Desktop/superkaramba-0.35/superkaramba-0.35/doc´
<BR>Making all in en
<BR>make[3]: Entering directory `/home/giovanni/Desktop/superkaramba-0.35/superkaramba-0.35/doc/en´
<BR>make[3]: Nothing to be done for `all´.
<BR>make[3]: Leaving directory `/home/giovanni/Desktop/superkaramba-0.35/superkaramba-0.35/doc/en´
<BR>make[2]: Leaving directory `/home/giovanni/Desktop/superkaramba-0.35/superkaramba-0.35/doc´
<BR>Making all in po
<BR>make[2]: Entering directory `/home/giovanni/Desktop/superkaramba-0.35/superkaramba-0.35/po´
<BR>make[2]: Nothing to be done for `all´.
<BR>make[2]: Leaving directory `/home/giovanni/Desktop/superkaramba-0.35/superkaramba-0.35/po´
<BR>Making all in src
<BR>make[2]: Entering directory `/home/giovanni/Desktop/superkaramba-0.35/superkaramba-0.35/src´
<BR>make[3]: Entering directory `/home/giovanni/Desktop/superkaramba-0.35/superkaramba-0.35/src´
<BR>if g++ -DHAVE_CONFIG_H -I. -I. -I.. -I/opt/kde/include -I/usr/lib/qt/include -I/usr/X11R6/include -I/usr/include/xmms -I/usr/include/gtk-1.2 -I/usr/include/glib-1.2 -I/usr/lib/glib/include -I/usr/X11R6/include -DQT_THREAD_SUPPORT -D_REENTRANT-Wnon-virtual-dtor -Wno-long-long -Wundef -pedantic -W -Wpointer-arith -Wmissing-prototypes -ansi -D_XOPEN_SOURCE=500 -D_BSD_SOURCE -Wcast-align -Wconversion -O2 -fno-exceptions -fno-check-new -MT main.o -MD -MP -MF ".deps/main.Tpo" \
<BR> -c -o main.o `test -f ´main.cpp´ || echo ´./´`main.cpp; \
<BR>then mv -f ".deps/main.Tpo" ".deps/main.Po"; \
<BR>else rm -f ".deps/main.Tpo"; exit 1; \
<BR>fi
<BR>In file included from main.cpp:5:
<BR>karambaapp.h:14:20: Python.h: No such file or directory
<BR>In file included from main.cpp:19:
<BR>karamba.h:8:20: Python.h: No such file or directory
<BR>In file included from karamba.h:56,
<BR> from main.cpp:19:
<BR>imagelabel.h:26:20: Python.h: No such file or directory
<BR>In file included from main.cpp:22:
<BR>karamba_python.h:28:20: Python.h: No such file or directory
<BR>In file included from main.cpp:22:
<BR>karamba_python.h:44: error: syntax error before `*´ token
<BR>karamba_python.h:45: error: syntax error before `*´ token
<BR>karamba_python.h:46: error: ISO C++ forbids declaration of `PyThreadState´ with
<BR> no type
<BR>karamba_python.h:46: error: parse error before `*´ token
<BR>karamba_python.h:48: error: `myThreadState´ was not declared in this scope
<BR>karamba_python.h:48: error: invalid data member initialization
<BR>karamba_python.h:48: error: (use `=´ to initialize static data members)
<BR>karamba_python.h:48: error: variable or field `getLock´ declared void
<BR>karamba_python.h:49: error: syntax error before `*´ token
<BR>karamba_python.h:50: error: `myThreadState´ was not declared in this scope
<BR>karamba_python.h:50: error: invalid data member initialization
<BR>karamba_python.h:50: error: variable or field `releaseLock´ declared void
<BR>karamba_python.h:51: error: type specifier omitted for parameter `PyObject´
<BR>karamba_python.h:51: error: parse error before `*´ token
<BR>make[3]: *** [main.o] Error 1
<BR>make[3]: Leaving directory `/home/giovanni/Desktop/superkaramba-0.35/superkaramba-0.35/src´
<BR>make[2]: *** [all-recursive] Error 1
<BR>make[2]: Leaving directory `/home/giovanni/Desktop/superkaramba-0.35/superkaramba-0.35/src´
<BR>make[1]: *** [all-recursive] Error 1
<BR>make[1]: Leaving directory `/home/giovanni/Desktop/superkaramba-0.35/superkaramba-0.35´
<BR>make: *** [all] Error 2
<BR>root@giovanni:/home/giovanni/Desktop/superkaramba-0.35/superkaramba-0.35#</font>
<BR>
<BR><b>nn riesco a risolvere....ne sapete qualcosa? (versione 0.35)
<BR>
<BR>grazie ciao!!!!
</b><br>
<BR><font color="#FF0000">
<BR>root@giovanni:/home/giovanni/Desktop/superkaramba-0.35/superkaramba-0.35# make
<BR>make all-recursive
<BR>make[1]: Entering directory `/home/giovanni/Desktop/superkaramba-0.35/superkaramba-0.35´
<BR>Making all in doc
<BR>make[2]: Entering directory `/home/giovanni/Desktop/superkaramba-0.35/superkaramba-0.35/doc´
<BR>Making all in .
<BR>make[3]: Entering directory `/home/giovanni/Desktop/superkaramba-0.35/superkaramba-0.35/doc´
<BR>make[3]: Nothing to be done for `all-am´.
<BR>make[3]: Leaving directory `/home/giovanni/Desktop/superkaramba-0.35/superkaramba-0.35/doc´
<BR>Making all in en
<BR>make[3]: Entering directory `/home/giovanni/Desktop/superkaramba-0.35/superkaramba-0.35/doc/en´
<BR>make[3]: Nothing to be done for `all´.
<BR>make[3]: Leaving directory `/home/giovanni/Desktop/superkaramba-0.35/superkaramba-0.35/doc/en´
<BR>make[2]: Leaving directory `/home/giovanni/Desktop/superkaramba-0.35/superkaramba-0.35/doc´
<BR>Making all in po
<BR>make[2]: Entering directory `/home/giovanni/Desktop/superkaramba-0.35/superkaramba-0.35/po´
<BR>make[2]: Nothing to be done for `all´.
<BR>make[2]: Leaving directory `/home/giovanni/Desktop/superkaramba-0.35/superkaramba-0.35/po´
<BR>Making all in src
<BR>make[2]: Entering directory `/home/giovanni/Desktop/superkaramba-0.35/superkaramba-0.35/src´
<BR>make[3]: Entering directory `/home/giovanni/Desktop/superkaramba-0.35/superkaramba-0.35/src´
<BR>if g++ -DHAVE_CONFIG_H -I. -I. -I.. -I/opt/kde/include -I/usr/lib/qt/include -I/usr/X11R6/include -I/usr/include/xmms -I/usr/include/gtk-1.2 -I/usr/include/glib-1.2 -I/usr/lib/glib/include -I/usr/X11R6/include -DQT_THREAD_SUPPORT -D_REENTRANT-Wnon-virtual-dtor -Wno-long-long -Wundef -pedantic -W -Wpointer-arith -Wmissing-prototypes -ansi -D_XOPEN_SOURCE=500 -D_BSD_SOURCE -Wcast-align -Wconversion -O2 -fno-exceptions -fno-check-new -MT main.o -MD -MP -MF ".deps/main.Tpo" \
<BR> -c -o main.o `test -f ´main.cpp´ || echo ´./´`main.cpp; \
<BR>then mv -f ".deps/main.Tpo" ".deps/main.Po"; \
<BR>else rm -f ".deps/main.Tpo"; exit 1; \
<BR>fi
<BR>In file included from main.cpp:5:
<BR>karambaapp.h:14:20: Python.h: No such file or directory
<BR>In file included from main.cpp:19:
<BR>karamba.h:8:20: Python.h: No such file or directory
<BR>In file included from karamba.h:56,
<BR> from main.cpp:19:
<BR>imagelabel.h:26:20: Python.h: No such file or directory
<BR>In file included from main.cpp:22:
<BR>karamba_python.h:28:20: Python.h: No such file or directory
<BR>In file included from main.cpp:22:
<BR>karamba_python.h:44: error: syntax error before `*´ token
<BR>karamba_python.h:45: error: syntax error before `*´ token
<BR>karamba_python.h:46: error: ISO C++ forbids declaration of `PyThreadState´ with
<BR> no type
<BR>karamba_python.h:46: error: parse error before `*´ token
<BR>karamba_python.h:48: error: `myThreadState´ was not declared in this scope
<BR>karamba_python.h:48: error: invalid data member initialization
<BR>karamba_python.h:48: error: (use `=´ to initialize static data members)
<BR>karamba_python.h:48: error: variable or field `getLock´ declared void
<BR>karamba_python.h:49: error: syntax error before `*´ token
<BR>karamba_python.h:50: error: `myThreadState´ was not declared in this scope
<BR>karamba_python.h:50: error: invalid data member initialization
<BR>karamba_python.h:50: error: variable or field `releaseLock´ declared void
<BR>karamba_python.h:51: error: type specifier omitted for parameter `PyObject´
<BR>karamba_python.h:51: error: parse error before `*´ token
<BR>make[3]: *** [main.o] Error 1
<BR>make[3]: Leaving directory `/home/giovanni/Desktop/superkaramba-0.35/superkaramba-0.35/src´
<BR>make[2]: *** [all-recursive] Error 1
<BR>make[2]: Leaving directory `/home/giovanni/Desktop/superkaramba-0.35/superkaramba-0.35/src´
<BR>make[1]: *** [all-recursive] Error 1
<BR>make[1]: Leaving directory `/home/giovanni/Desktop/superkaramba-0.35/superkaramba-0.35´
<BR>make: *** [all] Error 2
<BR>root@giovanni:/home/giovanni/Desktop/superkaramba-0.35/superkaramba-0.35#</font>
<BR>
<BR><b>nn riesco a risolvere....ne sapete qualcosa? (versione 0.35)
<BR>
<BR>grazie ciao!!!!