Installazione ati driver
Inviato: dom 31 lug 2005, 13:37
Salve ho scaricato gli ultimi drivers della ati ... ma installandoli sulla 10.1 mi dà questo errore:
/lib/modules/fglrx/build_mod/2.6.x/agpgart_be.c: In function `agp_find_supported_device':
/lib/modules/fglrx/build_mod/2.6.x/agpgart_be.c:7136: error: structure has no member named `slot_name'
/lib/modules/fglrx/build_mod/2.6.x/agpgart_be.c:7156: error: structure has no member named `slot_name'
/lib/modules/fglrx/build_mod/2.6.x/agpgart_be.c:7161: error: structure has no member named `slot_name'
/lib/modules/fglrx/build_mod/2.6.x/agpgart_be.c:7187: error: structure has no member named `slot_name'
/lib/modules/fglrx/build_mod/2.6.x/agpgart_be.c:7207: error: structure has no member named `slot_name'
/lib/modules/fglrx/build_mod/2.6.x/agpgart_be.c:7227: error: structure has no member named `slot_name'
/lib/modules/fglrx/build_mod/2.6.x/agpgart_be.c:7232: error: structure has no member named `slot_name'
/lib/modules/fglrx/build_mod/2.6.x/agpgart_be.c: In function `__fgl_agp_init':
/lib/modules/fglrx/build_mod/2.6.x/agpgart_be.c:7613: warning: `pm_register' is deprecated (declared a
t include/linux/pm.h:106)
/lib/modules/fglrx/build_mod/2.6.x/agpgart_be.c: In function `__fgl_agp_cleanup':
/lib/modules/fglrx/build_mod/2.6.x/agpgart_be.c:7623: warning: `pm_unregister_all' is deprecated (decl
ared at include/linux/pm.h:116)
make[2]: *** [/lib/modules/fglrx/build_mod/2.6.x/agpgart_be.o] Error 1
make[1]: *** [_module_/lib/modules/fglrx/build_mod/2.6.x] Error 2
make[1]: Leaving directory `/usr/src/linux-2.6.12.3'
make: *** [kmod_build] Error 2
build failed with return value 2
[Error] Kernel Module : Failed to compile kernel module - please consult readme.
questo è l'errore che mi dà durante l'installazione .... qualcuno ha una soluzione che sto uscendo pazzo?
/lib/modules/fglrx/build_mod/2.6.x/agpgart_be.c: In function `agp_find_supported_device':
/lib/modules/fglrx/build_mod/2.6.x/agpgart_be.c:7136: error: structure has no member named `slot_name'
/lib/modules/fglrx/build_mod/2.6.x/agpgart_be.c:7156: error: structure has no member named `slot_name'
/lib/modules/fglrx/build_mod/2.6.x/agpgart_be.c:7161: error: structure has no member named `slot_name'
/lib/modules/fglrx/build_mod/2.6.x/agpgart_be.c:7187: error: structure has no member named `slot_name'
/lib/modules/fglrx/build_mod/2.6.x/agpgart_be.c:7207: error: structure has no member named `slot_name'
/lib/modules/fglrx/build_mod/2.6.x/agpgart_be.c:7227: error: structure has no member named `slot_name'
/lib/modules/fglrx/build_mod/2.6.x/agpgart_be.c:7232: error: structure has no member named `slot_name'
/lib/modules/fglrx/build_mod/2.6.x/agpgart_be.c: In function `__fgl_agp_init':
/lib/modules/fglrx/build_mod/2.6.x/agpgart_be.c:7613: warning: `pm_register' is deprecated (declared a
t include/linux/pm.h:106)
/lib/modules/fglrx/build_mod/2.6.x/agpgart_be.c: In function `__fgl_agp_cleanup':
/lib/modules/fglrx/build_mod/2.6.x/agpgart_be.c:7623: warning: `pm_unregister_all' is deprecated (decl
ared at include/linux/pm.h:116)
make[2]: *** [/lib/modules/fglrx/build_mod/2.6.x/agpgart_be.o] Error 1
make[1]: *** [_module_/lib/modules/fglrx/build_mod/2.6.x] Error 2
make[1]: Leaving directory `/usr/src/linux-2.6.12.3'
make: *** [kmod_build] Error 2
build failed with return value 2
[Error] Kernel Module : Failed to compile kernel module - please consult readme.
questo è l'errore che mi dà durante l'installazione .... qualcuno ha una soluzione che sto uscendo pazzo?