Problema nvidia dopo compilazione
Inviato: sab 27 ago 2005, 18:27
Ciao a tutti
Dopo la compilazione ho provato ad installare i driver nvidia ma mi restituisce un errore. Posto l'ultima partedel log di errore. sapete come risolvere?
In file included from include/linux/list.h:7,
from include/linux/wait.h:23,
from include/asm/semaphore.h:41,
from include/linux/sched.h:19,
from include/linux/module.h:10,
from /tmp/selfgz5003/NVIDIA-Linux-x86-1.0-7664-pkg1/usr/src
/nv/nv-linux.h:46,
from /tmp/selfgz5003/NVIDIA-Linux-x86-1.0-7664-pkg1/usr/src
/nv/os-registry.c:14:
include/linux/prefetch.h: In function `prefetch_range':
include/linux/prefetch.h:62: warning: pointer of type `void *' used in arith
metic
In file included from include/linux/dmapool.h:14,
from include/linux/pci.h:863,
from /tmp/selfgz5003/NVIDIA-Linux-x86-1.0-7664-pkg1/usr/src
/nv/nv-linux.h:69,
from /tmp/selfgz5003/NVIDIA-Linux-x86-1.0-7664-pkg1/usr/src
/nv/os-registry.c:14:
include/asm/io.h: In function `check_signature':
include/asm/io.h:242: warning: wrong type argument to increment
ld -m elf_i386 -r -o /tmp/selfgz5003/NVIDIA-Linux-x86-1.0-7664-pkg1/usr/s
rc/nv/nvidia.o /tmp/selfgz5003/NVIDIA-Linux-x86-1.0-7664-pkg1/usr/src/nv/nv-
kernel.o /tmp/selfgz5003/NVIDIA-Linux-x86-1.0-7664-pkg1/usr/src/nv/nv.o /tmp
/selfgz5003/NVIDIA-Linux-x86-1.0-7664-pkg1/usr/src/nv/nv-vm.o /tmp/selfgz500
3/
NVIDIA-Linux-x86-1.0-7664-pkg1/usr/src/nv/os-agp.o /tmp/selfgz5003/NVIDIA-Li
nux-x86-1.0-7664-pkg1/usr/src/nv/os-interface.o /tmp/selfgz5003/NVIDIA-Linux
-x86-1.0-7664-pkg1/usr/src/nv/os-registry.o
Building modules, stage 2.
make -rR -f /usr/src/linux-2.6.11.11/scripts/Makefile.modpost
/usr/src/linux-2.6.11.11/scripts/Makefile.modpost:38: .config: No such file
or directory
make[4]: *** No rule to make target `.config'. Stop.
make[3]: *** [modules] Error 2
make[2]: *** [modules] Error 2
NVIDIA: left KBUILD.
nvidia.ko failed to build!
make[1]: *** [module] Error 1
make: *** [module] Error 2
-> Error.
ERROR: Unable to build the NVIDIA kernel module.
ERROR: Installation has failed. Please see the file
'/var/log/nvidia-installer.log' for details. You may find suggestions
on fixing installation problems in the README available on the Linux
driver download page at http://www.nvidia.com.
Dopo la compilazione ho provato ad installare i driver nvidia ma mi restituisce un errore. Posto l'ultima partedel log di errore. sapete come risolvere?
In file included from include/linux/list.h:7,
from include/linux/wait.h:23,
from include/asm/semaphore.h:41,
from include/linux/sched.h:19,
from include/linux/module.h:10,
from /tmp/selfgz5003/NVIDIA-Linux-x86-1.0-7664-pkg1/usr/src
/nv/nv-linux.h:46,
from /tmp/selfgz5003/NVIDIA-Linux-x86-1.0-7664-pkg1/usr/src
/nv/os-registry.c:14:
include/linux/prefetch.h: In function `prefetch_range':
include/linux/prefetch.h:62: warning: pointer of type `void *' used in arith
metic
In file included from include/linux/dmapool.h:14,
from include/linux/pci.h:863,
from /tmp/selfgz5003/NVIDIA-Linux-x86-1.0-7664-pkg1/usr/src
/nv/nv-linux.h:69,
from /tmp/selfgz5003/NVIDIA-Linux-x86-1.0-7664-pkg1/usr/src
/nv/os-registry.c:14:
include/asm/io.h: In function `check_signature':
include/asm/io.h:242: warning: wrong type argument to increment
ld -m elf_i386 -r -o /tmp/selfgz5003/NVIDIA-Linux-x86-1.0-7664-pkg1/usr/s
rc/nv/nvidia.o /tmp/selfgz5003/NVIDIA-Linux-x86-1.0-7664-pkg1/usr/src/nv/nv-
kernel.o /tmp/selfgz5003/NVIDIA-Linux-x86-1.0-7664-pkg1/usr/src/nv/nv.o /tmp
/selfgz5003/NVIDIA-Linux-x86-1.0-7664-pkg1/usr/src/nv/nv-vm.o /tmp/selfgz500
3/
NVIDIA-Linux-x86-1.0-7664-pkg1/usr/src/nv/os-agp.o /tmp/selfgz5003/NVIDIA-Li
nux-x86-1.0-7664-pkg1/usr/src/nv/os-interface.o /tmp/selfgz5003/NVIDIA-Linux
-x86-1.0-7664-pkg1/usr/src/nv/os-registry.o
Building modules, stage 2.
make -rR -f /usr/src/linux-2.6.11.11/scripts/Makefile.modpost
/usr/src/linux-2.6.11.11/scripts/Makefile.modpost:38: .config: No such file
or directory
make[4]: *** No rule to make target `.config'. Stop.
make[3]: *** [modules] Error 2
make[2]: *** [modules] Error 2
NVIDIA: left KBUILD.
nvidia.ko failed to build!
make[1]: *** [module] Error 1
make: *** [module] Error 2
-> Error.
ERROR: Unable to build the NVIDIA kernel module.
ERROR: Installation has failed. Please see the file
'/var/log/nvidia-installer.log' for details. You may find suggestions
on fixing installation problems in the README available on the Linux
driver download page at http://www.nvidia.com.